请选择 进入手机版 | 继续访问电脑版
设为首页收藏本站

Android Studio 中文社区论坛

 找回密码
 立即注册

扫一扫,访问微社区

搜索
热搜: Android Sdk Gradle
查看: 368|回复: 0

[WINDOWS] 接入pushwoosh时出的问题,新人实在不知道怎么搞请高人指点

[复制链接]

1

主题

1

帖子

5

积分

新手上路

Rank: 1

积分
5
发表于 2018-3-2 15:10:18 | 显示全部楼层 |阅读模式
Executing tasks: [:generateDebugSources, :generateDebugAndroidTestSources, :mockableAndroidJar, :compileDebugAndroidTestSources, :compileDebugUnitTestSources, :compileDebugSources]

Configuration on demand is an incubating feature.
Configuration 'compile' in project ':' is deprecated. Use 'implementation' instead.
Observed package id 'build-tools;22.0.1' in inconsistent location 'C:\NVPACK\android-sdk-windows\build-tools\android-5.1' (Expected 'C:\NVPACK\android-sdk-windows\build-tools\22.0.1')
Could not find google-services.json while looking in [src/debug]
registerResGeneratingTask is deprecated, use registerGeneratedFolders(FileCollection)
Could not find google-services.json while looking in [src/release]
registerResGeneratingTask is deprecated, use registerGeneratedFolders(FileCollection)
:preBuild UP-TO-DATE
:preDebugBuild FAILED

FAILURE: Build failed with an exception.

* What went wrong:
Could not resolve all files for configuration ':debugCompileClasspath'.
> Could not find com.pushwoosh:pushwoosh:5.5.5.
  Searched in the following locations:
      file:/C:/NVPACK/android-sdk-windows/extras/m2repository/com/pushwoosh/pushwoosh/5.5.5/pushwoosh-5.5.5.pom
      file:/C:/NVPACK/android-sdk-windows/extras/m2repository/com/pushwoosh/pushwoosh/5.5.5/pushwoosh-5.5.5.jar
      file:/C:/NVPACK/android-sdk-windows/extras/google/m2repository/com/pushwoosh/pushwoosh/5.5.5/pushwoosh-5.5.5.pom
      file:/C:/NVPACK/android-sdk-windows/extras/google/m2repository/com/pushwoosh/pushwoosh/5.5.5/pushwoosh-5.5.5.jar
      file:/C:/NVPACK/android-sdk-windows/extras/android/m2repository/com/pushwoosh/pushwoosh/5.5.5/pushwoosh-5.5.5.pom
      file:/C:/NVPACK/android-sdk-windows/extras/android/m2repository/com/pushwoosh/pushwoosh/5.5.5/pushwoosh-5.5.5.jar
      file:/C:/Program Files/Android/Android Studio/gradle/m2repository/com/pushwoosh/pushwoosh/5.5.5/pushwoosh-5.5.5.pom
      file:/C:/Program Files/Android/Android Studio/gradle/m2repository/com/pushwoosh/pushwoosh/5.5.5/pushwoosh-5.5.5.jar
      https://dl.google.com/dl/android ... pushwoosh-5.5.5.pom
      https://dl.google.com/dl/android ... pushwoosh-5.5.5.jar
  Required by:
      project :

* Try:
Run with --stacktrace option to get the stack trace. Run with --info or --debug option to get more log output.

* Get more help at https://help.gradle.org

BUILD FAILED in 2s

1 actionable task: 1 executed


回复

使用道具 举报

您需要登录后才可以回帖 登录 | 立即注册

本版积分规则

AndroidStudio中文社区 ( 京ICP备06021553号 )  

资源: 安卓 | Android | 社区 | 问答 | APP | WEB | SEO | ASO | 软件外包 |

© 2013-2014 Android Studio

快速回复 返回顶部 返回列表